Reaction Details
TargetCarbonic anhydrase 9
LigandBDBM50037231
Substrate/Competitorn/a
Meas. Tech.ChEMBL_1436583 (CHEMBL3382963)
Ki 82±n/a nM
Citation SitaRam, naCeruso, MKhloya, PSupuran, CTSharma, PK 4-Functionalized 1,3-diarylpyrazoles bearing 6-aminosulfonylbenzothiazole moiety as potent inhibitors of carbonic anhydrase isoforms hCA I, II, IX and XII. Bioorg Med Chem22:6945-52 (2014) 
 
Carbonic anhydrase 9
Name:Carbonic anhydrase 9
Type:Enzyme
Mol. Mass.:49669.03
Organism:Homo sapiens (Human)
Description:Catalytic domain of human cloned isozyme was used in the assay
Residue:459
BDBM50037231
NameBDBM50037231
Synonyms:CHEMBL3356268
TypeSmall organic molecule
Emp. Form.C17H11N5O2S2
Mol. Mass.381.432
SMILESNS(=O)(=O)c1ccc2nc(sc2c1)-n1cc(C#N)c(n1)-c1ccccc1