Reaction Details
TargetCarbonic anhydrase 2
LigandBDBM50037238
Substrate/Competitorn/a
Meas. Tech.ChEMBL_1436582 (CHEMBL3382962)
Ki 2.7±n/a nM
Citation SitaRam, naCeruso, MKhloya, PSupuran, CTSharma, PK 4-Functionalized 1,3-diarylpyrazoles bearing 6-aminosulfonylbenzothiazole moiety as potent inhibitors of carbonic anhydrase isoforms hCA I, II, IX and XII. Bioorg Med Chem22:6945-52 (2014) 
 
Carbonic anhydrase 2
Name:Carbonic anhydrase 2
Type:Enzyme
Mol. Mass.:29250.71
Organism:Homo sapiens (Human)
Description:P00918
Residue:260
BDBM50037238
NameBDBM50037238
Synonyms:CHEMBL3356264
TypeSmall organic molecule
Emp. Form.C18H14N4O5S2
Mol. Mass.430.458
SMILESCOc1ccc(cc1)-c1nn(cc1C(O)=O)-c1nc2ccc(cc2s1)S(N)(=O)=O