Reaction Details
TargetCarbonic anhydrase 1
LigandBDBM50037251
Substrate/Competitorn/a
Meas. Tech.ChEMBL_1436581 (CHEMBL3382961)
Ki 7408±n/a nM
Citation SitaRam, naCeruso, MKhloya, PSupuran, CTSharma, PK 4-Functionalized 1,3-diarylpyrazoles bearing 6-aminosulfonylbenzothiazole moiety as potent inhibitors of carbonic anhydrase isoforms hCA I, II, IX and XII. Bioorg Med Chem22:6945-52 (2014) 
 
Carbonic anhydrase 1
Name:Carbonic anhydrase 1
Type:Enzyme
Mol. Mass.:28873.37
Organism:Homo sapiens (Human)
Description:P00915
Residue:261
BDBM50037251
NameBDBM50037251
Synonyms:CHEMBL3356258
TypeSmall organic molecule
Emp. Form.C18H14N4O3S2
Mol. Mass.398.459
SMILESCc1ccc(cc1)-c1nn(cc1C=O)-c1nc2ccc(cc2s1)S(N)(=O)=O