Reaction Details
TargetGenome polyprotein
LigandBDBM50037445
Substrate/Competitorn/a
Meas. Tech.ChEMBL_1437305 (CHEMBL3384808)
Ki 130±n/a nM
Citation Lampa, AAlogheli, HEhrenberg, AEÅkerblom, ESvensson, RArtursson, PDanielson, UHKarlén, ASandström, A Vinylated linear P2 pyrimidinyloxyphenylglycine based inhibitors of the HCV NS3/4A protease and corresponding macrocycles. Bioorg Med Chem22:6595-615 (2015) 
 
Genome polyprotein
Name:Genome polyprotein
Synonyms:Nonstructural protein NS3-4A
Type:PROTEIN
Mol. Mass.:71633.49
Organism:Hepatitis C virus
Description:ChEMBL_109716
Residue:674
BDBM50037445
NameBDBM50037445
Synonyms:CHEMBL3356717
TypeSmall organic molecule
Emp. Form.C42H50N6O9S
Mol. Mass.814.946
SMILESCOc1cc(Oc2ccc(cc2)C2NC(=O)[C@@H](CCCCCCCCCS(=O)(=O)NC(=O)c3ccccc3NC2=O)NC(=O)OC(C)(C)C)nc(n1)-c1ccccc1