Reaction Details
TargetGenome polyprotein
LigandBDBM50037498
Substrate/Competitorn/a
Meas. Tech.ChEMBL_1437305 (CHEMBL3384808)
Ki 220±n/a nM
Citation Lampa, AAlogheli, HEhrenberg, AEÅkerblom, ESvensson, RArtursson, PDanielson, UHKarlén, ASandström, A Vinylated linear P2 pyrimidinyloxyphenylglycine based inhibitors of the HCV NS3/4A protease and corresponding macrocycles. Bioorg Med Chem22:6595-615 (2015) 
 
Genome polyprotein
Name:Genome polyprotein
Synonyms:Nonstructural protein NS3-4A
Type:PROTEIN
Mol. Mass.:71633.49
Organism:Hepatitis C virus
Description:ChEMBL_109716
Residue:674
BDBM50037498
NameBDBM50037498
Synonyms:CHEMBL3356703
TypeSmall organic molecule
Emp. Form.C37H39N5O7S
Mol. Mass.697.8
SMILESCC(C)(C)OC(=O)N[C@H](C(=O)Nc1ccccc1C(=O)NS(=O)(=O)CCCC=C)c1ccc(Oc2cc(C=C)nc(n2)-c2ccccc2)cc1