Reaction Details
TargetGenome polyprotein
LigandBDBM50037499
Substrate/Competitorn/a
Meas. Tech.ChEMBL_1437305 (CHEMBL3384808)
Ki 310±n/a nM
Citation Lampa, AAlogheli, HEhrenberg, AEÅkerblom, ESvensson, RArtursson, PDanielson, UHKarlén, ASandström, A Vinylated linear P2 pyrimidinyloxyphenylglycine based inhibitors of the HCV NS3/4A protease and corresponding macrocycles. Bioorg Med Chem22:6595-615 (2015) 
 
Genome polyprotein
Name:Genome polyprotein
Synonyms:Nonstructural protein NS3-4A
Type:PROTEIN
Mol. Mass.:71633.49
Organism:Hepatitis C virus
Description:ChEMBL_109716
Residue:674
BDBM50037499
NameBDBM50037499
Synonyms:CHEMBL3356702
TypeSmall organic molecule
Emp. Form.C48H49N5O9S
Mol. Mass.871.996
SMILESCOc1ccc2c(Oc3ccc(cc3)[C@H](NC(=O)[C@@H](NC(=O)OC(C)(C)C)C(C)(C)C)C(=O)Nc3ccccc3C(=O)NS(=O)(=O)c3ccccc3)cc(nc2c1)-c1ccccc1