Reaction Details
TargetGenome polyprotein
LigandBDBM50037496
Substrate/Competitorn/a
Meas. Tech.ChEMBL_1437305 (CHEMBL3384808)
Ki 370±n/a nM
Citation Lampa, AAlogheli, HEhrenberg, AEÅkerblom, ESvensson, RArtursson, PDanielson, UHKarlén, ASandström, A Vinylated linear P2 pyrimidinyloxyphenylglycine based inhibitors of the HCV NS3/4A protease and corresponding macrocycles. Bioorg Med Chem22:6595-615 (2015) 
 
Genome polyprotein
Name:Genome polyprotein
Synonyms:Nonstructural protein NS3-4A
Type:PROTEIN
Mol. Mass.:71633.49
Organism:Hepatitis C virus
Description:ChEMBL_109716
Residue:674
BDBM50037496
NameBDBM50037496
Synonyms:CHEMBL3356705
TypeSmall organic molecule
Emp. Form.C37H39N5O8S
Mol. Mass.713.799
SMILESCOc1cc(Oc2ccc(cc2C=C)[C@H](NC(=O)OC(C)(C)C)C(=O)Nc2ccccc2C(=O)NS(=O)(=O)CCC=C)nc(n1)-c1ccccc1