Reaction Details
TargetNeuraminidase
LigandBDBM50037546
Substrate/Competitorn/a
Meas. Tech.ChEMBL_1438031 (CHEMBL3387278)
IC50 8.5±n/a nM
Citation Hong, BTChen, CLFang, JMTsai, KCWang, SYHuang, WICheng, YSWong, CH Oseltamivir hydroxamate and acyl sulfonamide derivatives as influenza neuraminidase inhibitors. Bioorg Med Chem22:6647-54 (2015) 
 
Neuraminidase
Name:Neuraminidase
Type:PROTEIN
Mol. Mass.:51863.92
Organism:Influenza A virus (strain A/USSR/90/1977 H1N1)
Description:ChEMBL_109720
Residue:470
BDBM50037546
NameBDBM50037546
Synonyms:CHEMBL3357205
TypeSmall organic molecule
Emp. Form.C22H33N5O4
Mol. Mass.431.5285
SMILESCCC(CC)O[C@@H]1C=C(C[C@H](NC(N)=N)[C@H]1NC(C)=O)C(=O)NOCc1ccccc1