Reaction Details
TargetNeuraminidase
LigandBDBM50037548
Substrate/Competitorn/a
Meas. Tech.ChEMBL_1438031 (CHEMBL3387278)
IC50 68±n/a nM
Citation Hong, BTChen, CLFang, JMTsai, KCWang, SYHuang, WICheng, YSWong, CH Oseltamivir hydroxamate and acyl sulfonamide derivatives as influenza neuraminidase inhibitors. Bioorg Med Chem22:6647-54 (2015) 
 
Neuraminidase
Name:Neuraminidase
Type:PROTEIN
Mol. Mass.:51863.92
Organism:Influenza A virus (strain A/USSR/90/1977 H1N1)
Description:ChEMBL_109720
Residue:470
BDBM50037548
NameBDBM50037548
Synonyms:CHEMBL3357207
TypeSmall organic molecule
Emp. Form.C15H27N3O5S
Mol. Mass.361.457
SMILESCCC(CC)O[C@@H]1C=C(C[C@H](N)[C@H]1NC(C)=O)C(=O)NS(C)(=O)=O