Reaction Details
TargetSigma non-opioid intracellular receptor 1
LigandBDBM50331293
Substrate/Competitorn/a
Meas. Tech.ChEMBL_1438832 (CHEMBL3390300)
Ki 182±n/a nM
Citation Gawaskar, SSchepmann, DBonifazi, AWünsch, B Synthesis, GluN2B affinity and selectivity of benzo[7]annulen-7-amines. Bioorg Med Chem22:6638-46 (2015) 
 
Sigma non-opioid intracellular receptor 1
Name:Sigma non-opioid intracellular receptor 1
Type:Protein
Mol. Mass.:25307.17
Organism:Cavia porcellus (Guinea pig)
Description:Q60492
Residue:223
BDBM50331293
NameBDBM50331293
Synonyms:7-methoxy-3-(4-phenylbutyl)-2,3,4,5-tetrahydro-1H-benzo[d]azepin-1-ol | CHEMBL1289403
TypeSmall organic molecule
Emp. Form.C21H27NO2
Mol. Mass.325.4446
SMILESCOc1ccc2C(O)CN(CCCCc3ccccc3)CCc2c1