Reaction Details
TargetGlutamate receptor ionotropic, NMDA 2B
LigandBDBM50331293
Substrate/Competitorn/a
Meas. Tech.ChEMBL_1438829 (CHEMBL3390297)
Ki 5.4±n/a nM
Citation Gawaskar, SSchepmann, DBonifazi, AWünsch, B Synthesis, GluN2B affinity and selectivity of benzo[7]annulen-7-amines. Bioorg Med Chem22:6638-46 (2015) 
 
Glutamate receptor ionotropic, NMDA 2B
Name:Glutamate receptor ionotropic, NMDA 2B
Type:PROTEIN
Mol. Mass.:166375.46
Organism:Homo sapiens (Human)
Description:ChEMBL_1438829
Residue:1484
BDBM50331293
NameBDBM50331293
Synonyms:7-methoxy-3-(4-phenylbutyl)-2,3,4,5-tetrahydro-1H-benzo[d]azepin-1-ol | CHEMBL1289403
TypeSmall organic molecule
Emp. Form.C21H27NO2
Mol. Mass.325.4446
SMILESCOc1ccc2C(O)CN(CCCCc3ccccc3)CCc2c1