Reaction Details
TargetProstaglandin G/H synthase 1
LigandBDBM50038399
Substrate/Competitorn/a
Meas. Tech.ChEMBL_1441181 (CHEMBL3378845)
IC50 8.1±n/a nM
Citation Özdemir, AAltintop, MDTuran-Zitouni, GÇiftçi, GAErtorun, IAlatas, ÖKaplancikli, ZA Synthesis and evaluation of new indole-based chalcones as potential antiinflammatory agents. Eur J Med Chem89:304-9 (2014) 
 
Prostaglandin G/H synthase 1
Name:Prostaglandin G/H synthase 1
Type:Protein
Mol. Mass.:68868.60
Organism:Ovis aries (Sheep)
Description:n/a
Residue:600
BDBM50038399
NameBDBM50038399
Synonyms:CHEMBL3361124
TypeSmall organic molecule
Emp. Form.C18H11BrN2O
Mol. Mass.351.197
SMILESBrc1ccc2[nH]cc(\C=C\C(=O)c3ccc(cc3)C#N)c2c1