Reaction Details
TargetAurora kinase B
LigandBDBM50038423
Substrate/Competitorn/a
Meas. Tech.ChEMBL_1441997 (CHEMBL3372797)
Kd 3.1±n/a nM
Citation Xie, FZhu, HZhang, HLang, QTang, LHuang, QYu, L In vitro and in vivo characterization of a benzofuran derivative, a potential anticancer agent, as a novel Aurora B kinase inhibitor. Eur J Med Chem89:310-9 (2014) 
 
Aurora kinase B
Name:Aurora kinase B
Type:Protein
Mol. Mass.:39327.72
Organism:Homo sapiens (Human)
Description:Q96GD4
Residue:344
BDBM50038423
NameBDBM50038423
Synonyms:CHEMBL3361128
TypeSmall organic molecule
Emp. Form.C15H10O4
Mol. Mass.254.2375
SMILESOc1ccc(\C=C2\Oc3ccccc3C2=O)cc1O