Reaction Details
TargetGlycogen synthase kinase-3 beta
LigandBDBM50038423
Substrate/Competitorn/a
Meas. Tech.ChEMBL_1441959 (CHEMBL3372225)
IC50 2630±n/a nM
Citation Xie, FZhu, HZhang, HLang, QTang, LHuang, QYu, L In vitro and in vivo characterization of a benzofuran derivative, a potential anticancer agent, as a novel Aurora B kinase inhibitor. Eur J Med Chem89:310-9 (2014) 
 
Glycogen synthase kinase-3 beta
Name:Glycogen synthase kinase-3 beta
Type:Enzyme
Mol. Mass.:46756.38
Organism:Homo sapiens (Human)
Description:P49841
Residue:420
BDBM50038423
NameBDBM50038423
Synonyms:CHEMBL3361128
TypeSmall organic molecule
Emp. Form.C15H10O4
Mol. Mass.254.2375
SMILESOc1ccc(\C=C2\Oc3ccccc3C2=O)cc1O