Reaction Details
TargetBiotin--protein ligase
LigandBDBM50039494
Substrate/Competitorn/a
Meas. Tech.ChEMBL_1445407 (CHEMBL3379106)
IC50 203700±n/a nM
Citation Sittiwong, WCordonier, ELZempleni, JDussault, PH ฿-Keto and฿-hydroxyphosphonate analogs of biotin-5'-AMP are inhibitors of holocarboxylase synthetase. Bioorg Med Chem Lett24:5568-71 (2014) 
 
Biotin--protein ligase
Name:Biotin--protein ligase
Type:PROTEIN
Mol. Mass.:80745.43
Organism:Homo sapiens (Human)
Description:ChEMBL_1475435
Residue:726
BDBM50039494
NameBDBM50039494
Synonyms:CHEMBL3357334
TypeSmall organic molecule
Emp. Form.C21H35N8O8PS
Mol. Mass.590.59
SMILES[NH4+].[H][C@]12CS[C@@H](CCCCC(O)CP([O-])(=O)OC[C@H]3O[C@H]([C@H](O)[C@@H]3O)n3cnc4c(N)ncnc34)[C@@]1([H])NC(=O)N2