Reaction Details
TargetCannabinoid receptor 2
LigandBDBM50039496
Substrate/Competitorn/a
Meas. Tech.ChEMBL_1445413 (CHEMBL3379646)
EC50 5.0±n/a nM
Citation Guidetti, RAstles, PCSanderson, AJHollinshead, SPJohnson, MPChambers, MG The SAR development of substituted purine derivatives as selective CB2 agonists for the treatment of chronic pain. Bioorg Med Chem Lett24:5572-5 (2014) 
 
Cannabinoid receptor 2
Name:Cannabinoid receptor 2
Type:G Protein-Coupled Receptor (GPCR)
Mol. Mass.:39690.94
Organism:Homo sapiens (Human)
Description:P34972
Residue:360
BDBM50039496
NameBDBM50039496
Synonyms:CHEMBL3357338
TypeSmall organic molecule
Emp. Form.C23H31ClN6O2
Mol. Mass.458.984
SMILESCCN1CCN(CC1)c1nc(C)nc2n(C(COC)COC)c(nc12)-c1ccccc1Cl