Reaction Details
TargetCannabinoid receptor 1
LigandBDBM50039666
Substrate/Competitorn/a
Meas. Tech.ChEMBL_1445415 (CHEMBL3379648)
EC50 4660±n/a nM
Citation Guidetti, RAstles, PCSanderson, AJHollinshead, SPJohnson, MPChambers, MG The SAR development of substituted purine derivatives as selective CB2 agonists for the treatment of chronic pain. Bioorg Med Chem Lett24:5572-5 (2014) 
 
Cannabinoid receptor 1
Name:Cannabinoid receptor 1
Type:G Protein-Coupled Receptor (GPCR)
Mol. Mass.:52868.96
Organism:Homo sapiens (Human)
Description:P21554
Residue:472
BDBM50039666
NameBDBM50039666
Synonyms:CHEMBL3139150
TypeSmall organic molecule
Emp. Form.C21H26ClN7O
Mol. Mass.427.93
SMILESCN1CCN(CC1)c1nc(C)nc2n(CCNC(C)=O)c(nc12)-c1ccccc1Cl