Reaction Details
TargetSerine/threonine-protein kinase mTOR
LigandBDBM125443
Substrate/Competitorn/a
Meas. Tech.ChEMBL_1446032 (CHEMBL3379685)
IC50 3700±n/a nM
Citation Lanman, BAReed, ABCee, VJHong, FTPettus, LHWurz, RPAndrews, KLJiang, JMcCarter, JDMullady, ELSan Miguel, TSubramanian, RWang, LWhittington, DAWu, TZalameda, LZhang, NTasker, ASHughes, PENorman, MH Phosphoinositide-3-kinase inhibitors: evaluation of substituted alcohols as replacements for the piperazine sulfonamide portion of AMG 511. Bioorg Med Chem Lett24:5630-4 (2014) 
 
Serine/threonine-protein kinase mTOR
Name:Serine/threonine-protein kinase mTOR
Type:Rapamycin target protein
Mol. Mass.:288917.12
Organism:Homo sapiens (Human)
Description:P42345
Residue:2549
BDBM125443
NameBDBM125443
Synonyms:US8772480, 298
TypeSmall organic molecule
Emp. Form.C18H18FN7O2
Mol. Mass.383.3796
SMILESCOc1ncc(Nc2ncc(cc2-c2nc(C)nc(N)n2)C2(O)CC2)cc1F