Reaction Details
TargetCarbonic anhydrase 3
LigandBDBM50040425
Substrate/Competitorn/a
Meas. Tech.ChEMBL_1443933 (CHEMBL3374773)
Ki>21000±n/a nM
Citation Ceruso, MAntel, SVullo, DScozzafava, ASupuran, CT Inhibition studies of new ureido-substituted sulfonamides incorporating a GABA moiety against human carbonic anhydrase isoforms I-XIV. Bioorg Med Chem22:6768-75 (2015) 
 
Carbonic anhydrase 3
Name:Carbonic anhydrase 3
Type:Enzyme
Mol. Mass.:29562.11
Organism:Homo sapiens (Human)
Description:Human cloned isozyme.
Residue:260
BDBM50040425
NameBDBM50040425
Synonyms:CHEMBL3360588
TypeSmall organic molecule
Emp. Form.C19H24N4O4S
Mol. Mass.404.483
SMILESNS(=O)(=O)c1ccc(CNC(=O)CCCNC(=O)NCc2ccccc2)cc1