Reaction Details
TargetCarbonic anhydrase 4
LigandBDBM50040430
Substrate/Competitorn/a
Meas. Tech.ChEMBL_1443934 (CHEMBL3374774)
Ki 780±n/a nM
Citation Ceruso, MAntel, SVullo, DScozzafava, ASupuran, CT Inhibition studies of new ureido-substituted sulfonamides incorporating a GABA moiety against human carbonic anhydrase isoforms I-XIV. Bioorg Med Chem22:6768-75 (2015) 
 
Carbonic anhydrase 4
Name:Carbonic anhydrase 4
Type:Enzyme
Mol. Mass.:35037.98
Organism:Homo sapiens (Human)
Description:P22748
Residue:312
BDBM50040430
NameBDBM50040430
Synonyms:CHEMBL3360589
TypeSmall organic molecule
Emp. Form.C20H26N4O4S
Mol. Mass.418.51
SMILESNS(=O)(=O)c1ccc(CCNC(=O)CCCNC(=O)NCc2ccccc2)cc1