Reaction Details
TargetCarbonic anhydrase 4
LigandBDBM50040428
Substrate/Competitorn/a
Meas. Tech.ChEMBL_1443934 (CHEMBL3374774)
Ki 738±n/a nM
Citation Ceruso, MAntel, SVullo, DScozzafava, ASupuran, CT Inhibition studies of new ureido-substituted sulfonamides incorporating a GABA moiety against human carbonic anhydrase isoforms I-XIV. Bioorg Med Chem22:6768-75 (2015) 
 
Carbonic anhydrase 4
Name:Carbonic anhydrase 4
Type:Enzyme
Mol. Mass.:35037.98
Organism:Homo sapiens (Human)
Description:P22748
Residue:312
BDBM50040428
NameBDBM50040428
Synonyms:CHEMBL3360591
TypeSmall organic molecule
Emp. Form.C19H23N5O6S
Mol. Mass.449.481
SMILESNS(=O)(=O)c1ccc(CCNC(=O)CCCNC(=O)Nc2ccc(cc2)[N+]([O-])=O)cc1