Reaction Details
TargetCarbonic anhydrase 7
LigandBDBM50040427
Substrate/Competitorn/a
Meas. Tech.ChEMBL_1443937 (CHEMBL3374777)
Ki 51±n/a nM
Citation Ceruso, MAntel, SVullo, DScozzafava, ASupuran, CT Inhibition studies of new ureido-substituted sulfonamides incorporating a GABA moiety against human carbonic anhydrase isoforms I-XIV. Bioorg Med Chem22:6768-75 (2015) 
 
Carbonic anhydrase 7
Name:Carbonic anhydrase 7
Type:Enzyme
Mol. Mass.:29664.11
Organism:Homo sapiens (Human)
Description:Human cloned isozyme.
Residue:264
BDBM50040427
NameBDBM50040427
Synonyms:CHEMBL3360586
TypeSmall organic molecule
Emp. Form.C18H22N4O4S
Mol. Mass.390.457
SMILESNS(=O)(=O)c1ccc(CNC(=O)CCCNC(=O)Nc2ccccc2)cc1