Reaction Details
TargetCarbonic anhydrase 13
LigandBDBM50040429
Substrate/Competitorn/a
Meas. Tech.ChEMBL_1443940 (CHEMBL3374780)
Ki>240±n/a nM
Citation Ceruso, MAntel, SVullo, DScozzafava, ASupuran, CT Inhibition studies of new ureido-substituted sulfonamides incorporating a GABA moiety against human carbonic anhydrase isoforms I-XIV. Bioorg Med Chem22:6768-75 (2015) 
 
Carbonic anhydrase 13
Name:Carbonic anhydrase 13
Type:Enzyme
Mol. Mass.:29445.78
Organism:Homo sapiens (Human)
Description:Q8N1Q1
Residue:262
BDBM50040429
NameBDBM50040429
Synonyms:CHEMBL3360590
TypeSmall organic molecule
Emp. Form.C20H26N4O4S
Mol. Mass.418.51
SMILESNS(=O)(=O)c1ccc(CNC(=O)CCCNC(=O)NCCc2ccccc2)cc1