Reaction Details
TargetCarbonic anhydrase 14
LigandBDBM50040427
Substrate/Competitorn/a
Meas. Tech.ChEMBL_1443941 (CHEMBL3374781)
Ki 239±n/a nM
Citation Ceruso, MAntel, SVullo, DScozzafava, ASupuran, CT Inhibition studies of new ureido-substituted sulfonamides incorporating a GABA moiety against human carbonic anhydrase isoforms I-XIV. Bioorg Med Chem22:6768-75 (2015) 
 
Carbonic anhydrase 14
Name:Carbonic anhydrase 14
Type:Enzyme
Mol. Mass.:37665.67
Organism:Homo sapiens (Human)
Description:Human (cloned) isozyme.
Residue:337
BDBM50040427
NameBDBM50040427
Synonyms:CHEMBL3360586
TypeSmall organic molecule
Emp. Form.C18H22N4O4S
Mol. Mass.390.457
SMILESNS(=O)(=O)c1ccc(CNC(=O)CCCNC(=O)Nc2ccccc2)cc1