Reaction Details
TargetInterleukin-1 receptor-associated kinase 4
LigandBDBM50040805
Substrate/Competitorn/a
Meas. Tech.ChEMBL_1444239 (CHEMBL3380178)
Ki 1.000000±n/a nM
Citation Chaudhary, DRobinson, SRomero, DL Recent advances in the discovery of small molecule inhibitors of interleukin-1 receptor-associated kinase 4 (IRAK4) as a therapeutic target for inflammation and oncology disorders. J Med Chem58:96-110 (2015) 
 
Interleukin-1 receptor-associated kinase 4
Name:Interleukin-1 receptor-associated kinase 4
Type:Protein
Mol. Mass.:51519.08
Organism:Homo sapiens (Human)
Description:Q9NWZ3
Residue:460
BDBM50040805
NameBDBM50040805
Synonyms:CHEMBL3361255
TypeSmall organic molecule
Emp. Form.C22H30N4O4S
Mol. Mass.446.563
SMILESNC(=O)[C@@H](O)C[C@H]1CCc2sc3ncnc(O[C@H]4CC[C@@H](CC4)N4CCOCC4)c3c12