Reaction Details
TargetInterleukin-1 receptor-associated kinase 4
LigandBDBM50040809
Substrate/Competitorn/a
Meas. Tech.ChEMBL_1444238 (CHEMBL3380177)
IC50<100±n/a nM
Citation Chaudhary, DRobinson, SRomero, DL Recent advances in the discovery of small molecule inhibitors of interleukin-1 receptor-associated kinase 4 (IRAK4) as a therapeutic target for inflammation and oncology disorders. J Med Chem58:96-110 (2015) 
 
Interleukin-1 receptor-associated kinase 4
Name:Interleukin-1 receptor-associated kinase 4
Type:Protein
Mol. Mass.:51519.08
Organism:Homo sapiens (Human)
Description:Q9NWZ3
Residue:460
BDBM50040809
NameBDBM50040809
Synonyms:CHEMBL3353209 | US9169260, 320
TypeSmall organic molecule
Emp. Form.C24H27N9O
Mol. Mass.457.5309
SMILESCc1ccc(nc1)-n1nc(cc1NC(=O)c1cnn2cccnc12)N1CCN(CC1)C1CCC1