Reaction Details
TargetInterleukin-1 receptor-associated kinase 4
LigandBDBM50040869
Substrate/Competitorn/a
Meas. Tech.ChEMBL_1444238 (CHEMBL3380177)
IC50 16±n/a nM
Citation Chaudhary, DRobinson, SRomero, DL Recent advances in the discovery of small molecule inhibitors of interleukin-1 receptor-associated kinase 4 (IRAK4) as a therapeutic target for inflammation and oncology disorders. J Med Chem58:96-110 (2015) 
 
Interleukin-1 receptor-associated kinase 4
Name:Interleukin-1 receptor-associated kinase 4
Type:Protein
Mol. Mass.:51519.08
Organism:Homo sapiens (Human)
Description:Q9NWZ3
Residue:460
BDBM50040869
NameBDBM50040869
Synonyms:CHEMBL3353204
TypeSmall organic molecule
Emp. Form.C22H30N8O2S
Mol. Mass.470.591
SMILESNCCNc1cccc2nc(sc12)-c1c(N[C@@H]2CCCNC2)nc([nH]c1=O)N1CCOCC1