Reaction Details
TargetInterleukin-1 receptor-associated kinase 4
LigandBDBM50040873
Substrate/Competitorn/a
Meas. Tech.ChEMBL_1444238 (CHEMBL3380177)
IC50 0.360000±n/a nM
Citation Chaudhary, DRobinson, SRomero, DL Recent advances in the discovery of small molecule inhibitors of interleukin-1 receptor-associated kinase 4 (IRAK4) as a therapeutic target for inflammation and oncology disorders. J Med Chem58:96-110 (2015) 
 
Interleukin-1 receptor-associated kinase 4
Name:Interleukin-1 receptor-associated kinase 4
Type:Protein
Mol. Mass.:51519.08
Organism:Homo sapiens (Human)
Description:Q9NWZ3
Residue:460
BDBM50040873
NameBDBM50040873
Synonyms:CHEMBL3353188
TypeSmall organic molecule
Emp. Form.C20H16ClF3N8O3
Mol. Mass.508.841
SMILESCl.NC(=O)c1nn(cc1NC(=O)c1coc(n1)-c1ccnc(NCC(F)(F)F)c1)-c1cccnc1