Reaction Details
TargetCannabinoid receptor 2
LigandBDBM50040897
Substrate/Competitorn/a
Meas. Tech.ChEMBL_1444588 (CHEMBL3375407)
EC50 3550±n/a nM
Citation Gianella-Borradori, MChristou, IBataille, CJCross, RLWynne, GMGreaves, DRRussell, AJ Ligand-based virtual screening identifies a family of selective cannabinoid receptor 2 agonists. Bioorg Med Chem23:241-63 (2014) 
 
Cannabinoid receptor 2
Name:Cannabinoid receptor 2
Type:G Protein-Coupled Receptor (GPCR)
Mol. Mass.:39690.94
Organism:Homo sapiens (Human)
Description:P34972
Residue:360
BDBM50040897
NameBDBM50040897
Synonyms:CHEMBL3353818
TypeSmall organic molecule
Emp. Form.C17H11N5OS
Mol. Mass.333.367
SMILES[O-][S+](Cc1ccccc1C#N)c1nnc2c(n1)[nH]c1ccccc21