Reaction Details
TargetCannabinoid receptor 2
LigandBDBM50040932
Substrate/Competitorn/a
Meas. Tech.ChEMBL_1444588 (CHEMBL3375407)
EC50 144±n/a nM
Citation Gianella-Borradori, MChristou, IBataille, CJCross, RLWynne, GMGreaves, DRRussell, AJ Ligand-based virtual screening identifies a family of selective cannabinoid receptor 2 agonists. Bioorg Med Chem23:241-63 (2014) 
 
Cannabinoid receptor 2
Name:Cannabinoid receptor 2
Type:G Protein-Coupled Receptor (GPCR)
Mol. Mass.:39690.94
Organism:Homo sapiens (Human)
Description:P34972
Residue:360
BDBM50040932
NameBDBM50040932
Synonyms:CHEMBL3353831
TypeSmall organic molecule
Emp. Form.C21H17N5S
Mol. Mass.371.458
SMILESN#Cc1ccccc1CSc1nnc2c(n1)n(CC1CC1)c1ccccc21