Reaction Details
TargetCannabinoid receptor 1
LigandBDBM50040934
Substrate/Competitorn/a
Meas. Tech.ChEMBL_1444589 (CHEMBL3375408)
EC50 1553±n/a nM
Citation Gianella-Borradori, MChristou, IBataille, CJCross, RLWynne, GMGreaves, DRRussell, AJ Ligand-based virtual screening identifies a family of selective cannabinoid receptor 2 agonists. Bioorg Med Chem23:241-63 (2014) 
 
Cannabinoid receptor 1
Name:Cannabinoid receptor 1
Type:G Protein-Coupled Receptor (GPCR)
Mol. Mass.:52868.96
Organism:Homo sapiens (Human)
Description:P21554
Residue:472
BDBM50040934
NameBDBM50040934
Synonyms:CHEMBL3353833
TypeSmall organic molecule
Emp. Form.C24H17N5S
Mol. Mass.407.49
SMILESN#Cc1ccccc1CSc1nnc2c(n1)n(Cc1ccccc1)c1ccccc21