Reaction Details
TargetCannabinoid receptor 2
LigandBDBM50040934
Substrate/Competitorn/a
Meas. Tech.ChEMBL_1444590 (CHEMBL3375409)
Ki 11±n/a nM
Citation Gianella-Borradori, MChristou, IBataille, CJCross, RLWynne, GMGreaves, DRRussell, AJ Ligand-based virtual screening identifies a family of selective cannabinoid receptor 2 agonists. Bioorg Med Chem23:241-63 (2014) 
 
Cannabinoid receptor 2
Name:Cannabinoid receptor 2
Type:G Protein-Coupled Receptor (GPCR)
Mol. Mass.:39690.94
Organism:Homo sapiens (Human)
Description:P34972
Residue:360
BDBM50040934
NameBDBM50040934
Synonyms:CHEMBL3353833
TypeSmall organic molecule
Emp. Form.C24H17N5S
Mol. Mass.407.49
SMILESN#Cc1ccccc1CSc1nnc2c(n1)n(Cc1ccccc1)c1ccccc21