Reaction Details
TargetCannabinoid receptor 2
LigandBDBM50040945
Substrate/Competitorn/a
Meas. Tech.ChEMBL_1444590 (CHEMBL3375409)
Ki 360±n/a nM
Citation Gianella-Borradori, MChristou, IBataille, CJCross, RLWynne, GMGreaves, DRRussell, AJ Ligand-based virtual screening identifies a family of selective cannabinoid receptor 2 agonists. Bioorg Med Chem23:241-63 (2014) 
 
Cannabinoid receptor 2
Name:Cannabinoid receptor 2
Type:G Protein-Coupled Receptor (GPCR)
Mol. Mass.:39690.94
Organism:Homo sapiens (Human)
Description:P34972
Residue:360
BDBM50040945
NameBDBM50040945
Synonyms:CHEMBL3354396
TypeSmall organic molecule
Emp. Form.C22H17N5O3S
Mol. Mass.431.467
SMILESCOC(=O)CCC(=O)n1c2ccccc2c2nnc(SCc3ccccc3C#N)nc12