Reaction Details
TargetLanC-like protein 2
LigandBDBM50041087
Substrate/Competitorn/a
Meas. Tech.ChEMBL_1445717 (CHEMBL3374271)
IC50 6.6±n/a nM
Citation Bellotti, MSalis, AGrozio, ADamonte, GVigliarolo, TGalatini, AZocchi, EBenatti, UMillo, E Synthesis, structural characterization and effect on human granulocyte intracellular cAMP levels of abscisic acid analogs. Bioorg Med Chem23:22-32 (2014) 
 
LanC-like protein 2
Name:LanC-like protein 2
Type:PROTEIN
Mol. Mass.:50860.82
Organism:Homo sapiens (Human)
Description:ChEMBL_109536
Residue:450
BDBM50041087
NameBDBM50041087
Synonyms:CHEMBL3355910
TypeSmall organic molecule
Emp. Form.C15H20O5
Mol. Mass.280.3163
SMILESC\C(\C=C\C1(O)C2(C)OC2C(=O)CC1(C)C)=C\C(O)=O