Reaction Details
TargetCytochrome P450 2D6
LigandBDBM50041430
Substrate/Competitorn/a
Meas. Tech.ChEMBL_1443601 (CHEMBL3378973)
IC50>3000±n/a nM
Citation Iwata, YAndo, KTaniguchi, KKoba, NSugiura, ASudo, M Identification of a highly potent and selective CB2 agonist, RQ-00202730, for the treatment of irritable bowel syndrome. Bioorg Med Chem Lett25:236-40 (2014) 
 
Cytochrome P450 2D6
Name:Cytochrome P450 2D6
Type:Protein
Mol. Mass.:55774.82
Organism:Homo sapiens (Human)
Description:P10635
Residue:497
BDBM50041430
NameBDBM50041430
Synonyms:CHEMBL3357391
TypeSmall organic molecule
Emp. Form.C21H34N4O3S
Mol. Mass.422.585
SMILESCN(C)CCn1c(CC(C)(C)C)nc2cc(ccc12)S(=O)(=O)C1CN(CCO)C1