Reaction Details
TargetCannabinoid receptor 2
LigandBDBM50041433
Substrate/Competitorn/a
Meas. Tech.ChEMBL_1446274 (CHEMBL3373668)
EC50 14±n/a nM
Citation Iwata, YAndo, KTaniguchi, KKoba, NSugiura, ASudo, M Identification of a highly potent and selective CB2 agonist, RQ-00202730, for the treatment of irritable bowel syndrome. Bioorg Med Chem Lett25:236-40 (2014) 
 
Cannabinoid receptor 2
Name:Cannabinoid receptor 2
Type:G Protein-Coupled Receptor (GPCR)
Mol. Mass.:39690.94
Organism:Homo sapiens (Human)
Description:P34972
Residue:360
BDBM50041433
NameBDBM50041433
Synonyms:CHEMBL3357393
TypeSmall organic molecule
Emp. Form.C20H32N4O4S2
Mol. Mass.456.622
SMILESCN(C)CCn1c(CC(C)(C)C)nc2cc(ccc12)S(=O)(=O)C1CN(C1)S(C)(=O)=O