Reaction Details
TargetCannabinoid receptor 1
LigandBDBM50041442
Substrate/Competitorn/a
Meas. Tech.ChEMBL_1446275 (CHEMBL3373669)
EC50>25000±n/a nM
Citation Iwata, YAndo, KTaniguchi, KKoba, NSugiura, ASudo, M Identification of a highly potent and selective CB2 agonist, RQ-00202730, for the treatment of irritable bowel syndrome. Bioorg Med Chem Lett25:236-40 (2014) 
 
Cannabinoid receptor 1
Name:Cannabinoid receptor 1
Type:G Protein-Coupled Receptor (GPCR)
Mol. Mass.:52868.96
Organism:Homo sapiens (Human)
Description:P21554
Residue:472
BDBM50041442
NameBDBM50041442
Synonyms:CHEMBL3357388
TypeSmall organic molecule
Emp. Form.C24H35N5O4S
Mol. Mass.489.631
SMILESCC(=O)N1CCC(Cn2c(CC(C)(C)C)nc3cc(ccc23)S(=O)(=O)C2CN(C2)C(N)=O)CC1