Reaction Details
TargetCannabinoid receptor 2
LigandBDBM50041448
Substrate/Competitorn/a
Meas. Tech.ChEMBL_1446274 (CHEMBL3373668)
EC50 37±n/a nM
Citation Iwata, YAndo, KTaniguchi, KKoba, NSugiura, ASudo, M Identification of a highly potent and selective CB2 agonist, RQ-00202730, for the treatment of irritable bowel syndrome. Bioorg Med Chem Lett25:236-40 (2014) 
 
Cannabinoid receptor 2
Name:Cannabinoid receptor 2
Type:G Protein-Coupled Receptor (GPCR)
Mol. Mass.:39690.94
Organism:Homo sapiens (Human)
Description:P34972
Residue:360
BDBM50041448
NameBDBM50041448
Synonyms:CHEMBL3357369
TypeSmall organic molecule
Emp. Form.C22H33N3O2S
Mol. Mass.403.581
SMILESCN1CCC(CC1)S(=O)(=O)c1ccc2n(CC3CC3)c(CC(C)(C)C)nc2c1