Reaction Details
TargetCannabinoid receptor 2
LigandBDBM50041450
Substrate/Competitorn/a
Meas. Tech.ChEMBL_1446274 (CHEMBL3373668)
EC50 6.3±n/a nM
Citation Iwata, YAndo, KTaniguchi, KKoba, NSugiura, ASudo, M Identification of a highly potent and selective CB2 agonist, RQ-00202730, for the treatment of irritable bowel syndrome. Bioorg Med Chem Lett25:236-40 (2014) 
 
Cannabinoid receptor 2
Name:Cannabinoid receptor 2
Type:G Protein-Coupled Receptor (GPCR)
Mol. Mass.:39690.94
Organism:Homo sapiens (Human)
Description:P34972
Residue:360
BDBM50041450
NameBDBM50041450
Synonyms:CHEMBL3357371
TypeSmall organic molecule
Emp. Form.C22H32N4O3S
Mol. Mass.432.579
SMILESCC(C)(C)Cc1nc2cc(ccc2n1CC1CC1)S(=O)(=O)C1CCN(CC1)C(N)=O