Reaction Details
TargetCannabinoid receptor 2
LigandBDBM50041456
Substrate/Competitorn/a
Meas. Tech.ChEMBL_1446274 (CHEMBL3373668)
EC50 209±n/a nM
Citation Iwata, YAndo, KTaniguchi, KKoba, NSugiura, ASudo, M Identification of a highly potent and selective CB2 agonist, RQ-00202730, for the treatment of irritable bowel syndrome. Bioorg Med Chem Lett25:236-40 (2014) 
 
Cannabinoid receptor 2
Name:Cannabinoid receptor 2
Type:G Protein-Coupled Receptor (GPCR)
Mol. Mass.:39690.94
Organism:Homo sapiens (Human)
Description:P34972
Residue:360
BDBM50041456
NameBDBM50041456
Synonyms:CHEMBL3357377
TypeSmall organic molecule
Emp. Form.C23H35N3O2S
Mol. Mass.417.608
SMILESCN1CCC(CS(=O)(=O)c2ccc3n(CC4CC4)c(CC(C)(C)C)nc3c2)CC1