Reaction Details
TargetCannabinoid receptor 2
LigandBDBM50041439
Substrate/Competitorn/a
Meas. Tech.ChEMBL_1446274 (CHEMBL3373668)
EC50 5.9±n/a nM
Citation Iwata, YAndo, KTaniguchi, KKoba, NSugiura, ASudo, M Identification of a highly potent and selective CB2 agonist, RQ-00202730, for the treatment of irritable bowel syndrome. Bioorg Med Chem Lett25:236-40 (2014) 
 
Cannabinoid receptor 2
Name:Cannabinoid receptor 2
Type:G Protein-Coupled Receptor (GPCR)
Mol. Mass.:39690.94
Organism:Homo sapiens (Human)
Description:P34972
Residue:360
BDBM50041439
NameBDBM50041439
Synonyms:CHEMBL3357385
TypeSmall organic molecule
Emp. Form.C19H25F3N4O4S
Mol. Mass.462.486
SMILESCC(C)(C)Cc1nc2cc(ccc2n1CCOC(F)(F)F)S(=O)(=O)C1CN(C1)C(N)=O