Reaction Details
TargetCannabinoid receptor 2
LigandBDBM50041440
Substrate/Competitorn/a
Meas. Tech.ChEMBL_1446274 (CHEMBL3373668)
EC50 14±n/a nM
Citation Iwata, YAndo, KTaniguchi, KKoba, NSugiura, ASudo, M Identification of a highly potent and selective CB2 agonist, RQ-00202730, for the treatment of irritable bowel syndrome. Bioorg Med Chem Lett25:236-40 (2014) 
 
Cannabinoid receptor 2
Name:Cannabinoid receptor 2
Type:G Protein-Coupled Receptor (GPCR)
Mol. Mass.:39690.94
Organism:Homo sapiens (Human)
Description:P34972
Residue:360
BDBM50041440
NameBDBM50041440
Synonyms:CHEMBL3357386
TypeSmall organic molecule
Emp. Form.C20H30N4O4S
Mol. Mass.422.542
SMILESCC(C)(C)Cc1nc2cc(ccc2n1CC(C)(C)O)S(=O)(=O)C1CN(C1)C(N)=O