Reaction Details
TargetBeta-secretase 1
LigandBDBM50042292
Substrate/Competitorn/a
Meas. Tech.ChEMBL_1444279 (CHEMBL3380862)
Ki 64±n/a nM
Citation Ghosh, AKBrindisi, MYen, YCXu, XHuang, XDevasamudram, TBilcer, GLei, HKoelsch, GMesecar, ADTang, J Structure-based design, synthesis and biological evaluation of novelß-secretase inhibitors containing a pyrazole or thiazole moiety as the P3 ligand. Bioorg Med Chem Lett25:668-72 (2015) 
 
Beta-secretase 1
Name:Beta-secretase 1
Type:Protein
Mol. Mass.:55755.10
Organism:Homo sapiens (Human)
Description:P56817
Residue:501
BDBM50042292
NameBDBM50042292
Synonyms:CHEMBL3361309
TypeSmall organic molecule
Emp. Form.C32H58N6O5S
Mol. Mass.638.905
SMILESCSC[C@H](NC(=O)[C@@H](C)Cn1nc(C)cc1C)C(=O)N[C@@H](CC(C)C)[C@@H](O)C[C@@H](C)C(=O)N[C@@H](C(C)C)C(=O)NCC(C)C