Reaction Details
TargetHistone deacetylase 1
LigandBDBM50027520
Substrate/Competitorn/a
Meas. Tech.ChEMBL_1444619 (CHEMBL3376038)
IC50 5.0±n/a nM
Citation Giannini, GBattistuzzi, GVignola, D Hydroxamic acid based histone deacetylase inhibitors with confirmed activity against the malaria parasite. Bioorg Med Chem Lett25:459-61 (2015) 
 
Histone deacetylase 1
Name:Histone deacetylase 1
Type:Enzyme
Mol. Mass.:55090.27
Organism:Homo sapiens (Human)
Description:Q13547
Residue:482
BDBM50027520
NameBDBM50027520
Synonyms:CHEMBL3353927
TypeSmall organic molecule
Emp. Form.C19H24F3N3O3S
Mol. Mass.431.472
SMILESFC(F)(F)c1cccc(NC(=O)[C@H](CCCCCS)NC(=O)[C@H]2CCC(=O)N2)c1