Reaction Details
TargetPhosphatidylinositol 4-phosphate 3-kinase C2 domain-containing subunit beta
LigandBDBM25045
Substrate/Competitorn/a
Meas. Tech.ChEMBL_1444672 (CHEMBL3376670)
IC50 26±n/a nM
Citation Mountford, SJZheng, ZSundaram, KJennings, IGHamilton, JRThompson, PE Class II but Not Second Class-Prospects for the Development of Class II PI3K Inhibitors. ACS Med Chem Lett6:3-6 (2015) 
 
Phosphatidylinositol 4-phosphate 3-kinase C2 domain-containing subunit beta
Name:Phosphatidylinositol 4-phosphate 3-kinase C2 domain-containing subunit beta
Type:Enzyme
Mol. Mass.:184784.86
Organism:Homo sapiens (Human)
Description:O00750
Residue:1634
BDBM25045
NameBDBM25045
Synonyms:3-(4-morpholin-4-ylpyrido[2,3]furo[2,4-b]pyrimidin-2-yl)phenol 3-(4-morpholinopyrido[2,3]furo[2,4-b]pyrimidin-2-yl)phenol 3-[6-(morpholin-4-yl)-8-oxa-3,5,10-triazatricyclo[7.4.0.0^{2,7}]trideca-1(9),2,4,6,10,12-hexaen-4-yl]phenol PI-103 cid_9884685 pyridofuropyrimidine derivative, 2
TypeSmall organic molecule
Emp. Form.C19H16N4O3
Mol. Mass.348.3553
SMILESOc1cccc(c1)-c1nc(N2CCOCC2)c2oc3ncccc3c2n1