Reaction Details
TargetPhosphatidylinositol 4-phosphate 3-kinase C2 domain-containing subunit beta
LigandBDBM50042927
Substrate/Competitorn/a
Meas. Tech.ChEMBL_1444672 (CHEMBL3376670)
IC50 530±n/a nM
Citation Mountford, SJZheng, ZSundaram, KJennings, IGHamilton, JRThompson, PE Class II but Not Second Class-Prospects for the Development of Class II PI3K Inhibitors. ACS Med Chem Lett6:3-6 (2015) 
 
Phosphatidylinositol 4-phosphate 3-kinase C2 domain-containing subunit beta
Name:Phosphatidylinositol 4-phosphate 3-kinase C2 domain-containing subunit beta
Type:Enzyme
Mol. Mass.:184784.86
Organism:Homo sapiens (Human)
Description:O00750
Residue:1634
BDBM50042927
NameBDBM50042927
Synonyms:CHEMBL3354564
TypeSmall organic molecule
Emp. Form.C30H27N5O4S
Mol. Mass.553.631
SMILESCC(=O)Nc1ccc2nc(nc(N3CCOCC3)c2c1)-c1cccc(NS(=O)(=O)c2cccc3ccccc23)c1