Reaction Details
TargetDual specificity protein kinase TTK
LigandBDBM50042932
Substrate/Competitorn/a
Meas. Tech.ChEMBL_1444682 (CHEMBL3377244)
IC50 0.700000±n/a nM
Citation Rosse, G Combination of novel imidazopyridazine mps-1 kinase inhibitors and bcl-2 family protein inhibitors. ACS Med Chem Lett6:7-8 (2015) 
 
Dual specificity protein kinase TTK
Name:Dual specificity protein kinase TTK
Type:Protein
Mol. Mass.:97086.79
Organism:Homo sapiens (Human)
Description:P33981
Residue:857
BDBM50042932
NameBDBM50042932
Synonyms:CHEMBL3354996 | US9512126, 17
TypeSmall organic molecule
Emp. Form.C29H26F5N5O
Mol. Mass.555.5417
SMILESCc1cc(ccc1C(=O)NC1CC1)-c1cnc2c(NCCC(F)(F)F)cc(nn12)C1(CC1)c1cccc(F)c1F