Reaction Details
TargetSerine/threonine-protein kinase Sgk1
LigandBDBM50043018
Substrate/Competitorn/a
Meas. Tech.ChEMBL_1444808 (CHEMBL3379051)
IC50 280±n/a nM
Citation Rosse, G Novel azaindazole sulfonamides inhibitors of serum and glucocorticoid regulated kinase. ACS Med Chem Lett6:19-20 (2015) 
 
Serine/threonine-protein kinase Sgk1
Name:Serine/threonine-protein kinase Sgk1
Type:Other Protein Type
Mol. Mass.:48954.40
Organism:Homo sapiens (Human)
Description:Recombinant human SGK-1 enzyme produced in a baculovirus system.
Residue:431
BDBM50043018
NameBDBM50043018
Synonyms:CHEMBL3355028 | US9718825, Example 63
TypeSmall organic molecule
Emp. Form.C20H18Cl2N6O3S
Mol. Mass.493.366
SMILESNCCCOc1nc(nc2[nH]ncc12)-c1ccc(NS(=O)(=O)c2cc(Cl)ccc2Cl)cc1