Reaction Details
TargetMaternal embryonic leucine zipper kinase
LigandBDBM50043333
Substrate/Competitorn/a
Meas. Tech.ChEMBL_1444812 (CHEMBL3379055)
IC50 160000±n/a nM
Citation Johnson, CNBerdini, VBeke, LBonnet, PBrehmer, DCoyle, JEDay, PJFrederickson, MFreyne, EJGilissen, RAHamlett, CCHoward, SMeerpoel, LMcMenamin, RPatel, SRees, DCSharff, ASommen, FWu, TLinders, JT Fragment-based discovery of type I inhibitors of maternal embryonic leucine zipper kinase. ACS Med Chem Lett6:25-30 (2015) 
 
Maternal embryonic leucine zipper kinase
Name:Maternal embryonic leucine zipper kinase
Type:Enzyme
Mol. Mass.:74665.45
Organism:Homo sapiens (Human)
Description:Q14680
Residue:651
BDBM50043333
NameBDBM50043333
Synonyms:CHEMBL3355053
TypeSmall organic molecule
Emp. Form.C16H15FN2O
Mol. Mass.270.3015
SMILESFc1ccc(cc1)C(=O)Nc1ccc2CCNCc2c1