Reaction Details
TargetMaternal embryonic leucine zipper kinase
LigandBDBM50043369
Substrate/Competitorn/a
Meas. Tech.ChEMBL_1444812 (CHEMBL3379055)
IC50 4200±n/a nM
Citation Johnson, CNBerdini, VBeke, LBonnet, PBrehmer, DCoyle, JEDay, PJFrederickson, MFreyne, EJGilissen, RAHamlett, CCHoward, SMeerpoel, LMcMenamin, RPatel, SRees, DCSharff, ASommen, FWu, TLinders, JT Fragment-based discovery of type I inhibitors of maternal embryonic leucine zipper kinase. ACS Med Chem Lett6:25-30 (2015) 
 
Maternal embryonic leucine zipper kinase
Name:Maternal embryonic leucine zipper kinase
Type:Enzyme
Mol. Mass.:74665.45
Organism:Homo sapiens (Human)
Description:Q14680
Residue:651
BDBM50043369
NameBDBM50043369
Synonyms:CHEMBL3355055
TypeSmall organic molecule
Emp. Form.C23H25N3O4
Mol. Mass.407.4623
SMILESCOc1cc(O)cc(Nc2ccc(C(=O)Nc3ccccc3)c(OCCCN)c2)c1